Reaction Details
TargetGlucose-6-phosphate 1-dehydrogenase
LigandBDBM50070942
Substrate/Competitorn/a
Meas. Tech.ChEMBL_467395 (CHEMBL921928)
IC50 250±n/a nM
Citation Shin, ESPark, JShin, JMCho, DCho, SYShin, DWHam, MKim, JBLee, TR Catechin gallates are NADP+-competitive inhibitors of glucose-6-phosphate dehydrogenase and other enzymes that employ NADP+ as a coenzyme. Bioorg Med Chem16:3580-6 (2008) 
 
Glucose-6-phosphate 1-dehydrogenase
Name:Glucose-6-phosphate 1-dehydrogenase
Type:PROTEIN
Mol. Mass.:57518.83
Organism:Saccharomyces cerevisiae S288c
Description:ChEMBL_467395
Residue:505
BDBM50070942
NameBDBM50070942
Synonyms:(-)-Epigallocatechin gallate (-)-epigallocatechin 3-gallate CHEMBL297453 Epigallocatechin 3-gallate cid_65064
TypeSmall organic molecule
Emp. Form.C22H18O11
Mol. Mass.458.3717
SMILESOc1cc(O)c2C[C@@H](OC(=O)c3cc(O)c(O)c(O)c3)[C@H](Oc2c1)c1cc(O)c(O)c(O)c1