Reaction Details
Target6-phosphogluconate dehydrogenase, decarboxylating
LigandBDBM23417
Substrate/Competitorn/a
Meas. Tech.ChEMBL_467396 (CHEMBL921930)
IC50>1000000±n/a nM
Citation Shin, ESPark, JShin, JMCho, DCho, SYShin, DWHam, MKim, JBLee, TR Catechin gallates are NADP+-competitive inhibitors of glucose-6-phosphate dehydrogenase and other enzymes that employ NADP+ as a coenzyme. Bioorg Med Chem16:3580-6 (2008) 
 
6-phosphogluconate dehydrogenase, decarboxylating
Name:6-phosphogluconate dehydrogenase, decarboxylating
Type:Protein
Mol. Mass.:53143.42
Organism:Homo sapiens (Human)
Description:P52209
Residue:483
BDBM23417
NameBDBM23417
Synonyms:α-CA inhibitor, 4 (2R,3R)-2-(3,4-dihydroxyphenyl)-3,4-dihydro-2H-1-benzopyran-3,5,7-triol L-Epicatechin | cid_72276
TypeFlavonol
Emp. Form.C15H14O6
Mol. Mass.290.2681
SMILESO[C@@H]1Cc2c(O)cc(O)cc2O[C@@H]1c1ccc(O)c(O)c1