Reaction Details
TargetGlucose-6-phosphate 1-dehydrogenase
LigandBDBM23417
Substrate/Competitorn/a
Meas. Tech.ChEMBL_467395 (CHEMBL921928)
IC50>1000000±n/a nM
Citation Shin, ESPark, JShin, JMCho, DCho, SYShin, DWHam, MKim, JBLee, TR Catechin gallates are NADP+-competitive inhibitors of glucose-6-phosphate dehydrogenase and other enzymes that employ NADP+ as a coenzyme. Bioorg Med Chem16:3580-6 (2008) 
 
Glucose-6-phosphate 1-dehydrogenase
Name:Glucose-6-phosphate 1-dehydrogenase
Type:PROTEIN
Mol. Mass.:57518.83
Organism:Saccharomyces cerevisiae S288c
Description:ChEMBL_467395
Residue:505
BDBM23417
NameBDBM23417
Synonyms:α-CA inhibitor, 4 (2R,3R)-2-(3,4-dihydroxyphenyl)-3,4-dihydro-2H-1-benzopyran-3,5,7-triol L-Epicatechin | cid_72276
TypeFlavonol
Emp. Form.C15H14O6
Mol. Mass.290.2681
SMILESO[C@@H]1Cc2c(O)cc(O)cc2O[C@@H]1c1ccc(O)c(O)c1