Reaction Details
TargetAndrogen receptor
LigandBDBM50373228
Substrate/Competitorn/a
Meas. Tech.ChEMBL_467617 (CHEMBL930492)
Ki 1.3±n/a nM
Citation Zhao, SShen, Yvan Oeveren, AMarschke, KBZhi, L Discovery of a novel series of nonsteroidal androgen receptor modulators: 5- or 6-oxachrysen-2-ones. Bioorg Med Chem Lett18:3431-5 (2008) 
 
Androgen receptor
Name:Androgen receptor
Type:Receptor
Mol. Mass.:99185.27
Organism:Homo sapiens (Human)
Description:CHO cells were stably transfected with human AR gene.
Residue:920
BDBM50373228
NameBDBM50373228
Synonyms:CHEMBL253535
TypeSmall organic molecule
Emp. Form.C17H10F3NO3
Mol. Mass.333.2614
SMILESOc1cccc2OCc3c(ccc4[nH]c(=O)cc(c34)C(F)(F)F)-c12