Reaction Details
TargetP2Y purinoceptor 1
LigandBDBM50373305
Substrate/Competitorn/a
Meas. Tech.ChEMBL_467631 (CHEMBL930506)
Ki 30±n/a nM
Citation Pfefferkorn, JAChoi, CWinters, TKennedy, RChi, LPerrin, LALu, GPing, YWMcClanahan, TSchroeder, RLeininger, MTGeyer, ASchefzick, SAtherton, J P2Y1 receptor antagonists as novel antithrombotic agents. Bioorg Med Chem Lett18:3338-43 (2008) 
 
P2Y purinoceptor 1
Name:P2Y purinoceptor 1
Type:Enzyme
Mol. Mass.:42090.25
Organism:Homo sapiens (Human)
Description:P47900
Residue:373
BDBM50373305
NameBDBM50373305
Synonyms:CHEMBL256088
TypeSmall organic molecule
Emp. Form.C28H27ClN4O2
Mol. Mass.486.993
SMILESCc1cc(Oc2ccccc2NC(=O)Nc2ccc(cc2)C2CCCC2)n(n1)-c1ccccc1Cl