Reaction Details
TargetP2Y purinoceptor 1
LigandBDBM50373317
Substrate/Competitorn/a
Meas. Tech.ChEMBL_467631 (CHEMBL930506)
Ki 270±n/a nM
Citation Pfefferkorn, JAChoi, CWinters, TKennedy, RChi, LPerrin, LALu, GPing, YWMcClanahan, TSchroeder, RLeininger, MTGeyer, ASchefzick, SAtherton, J P2Y1 receptor antagonists as novel antithrombotic agents. Bioorg Med Chem Lett18:3338-43 (2008) 
 
P2Y purinoceptor 1
Name:P2Y purinoceptor 1
Type:Enzyme
Mol. Mass.:42090.25
Organism:Homo sapiens (Human)
Description:P47900
Residue:373
BDBM50373317
NameBDBM50373317
Synonyms:CHEMBL257378
TypeSmall organic molecule
Emp. Form.C23H17F3N4O3
Mol. Mass.454.4013
SMILESFC(F)(F)Oc1ccc(NC(=O)Nc2ccccc2Oc2ccnn2-c2ccccc2)cc1