Reaction Details
TargetP2Y purinoceptor 1
LigandBDBM50373318
Substrate/Competitorn/a
Meas. Tech.ChEMBL_467631 (CHEMBL930506)
Ki 960±n/a nM
Citation Pfefferkorn, JAChoi, CWinters, TKennedy, RChi, LPerrin, LALu, GPing, YWMcClanahan, TSchroeder, RLeininger, MTGeyer, ASchefzick, SAtherton, J P2Y1 receptor antagonists as novel antithrombotic agents. Bioorg Med Chem Lett18:3338-43 (2008) 
 
P2Y purinoceptor 1
Name:P2Y purinoceptor 1
Type:Enzyme
Mol. Mass.:42090.25
Organism:Homo sapiens (Human)
Description:P47900
Residue:373
BDBM50373318
NameBDBM50373318
Synonyms:CHEMBL255727
TypeSmall organic molecule
Emp. Form.C25H21F3N4O4
Mol. Mass.498.4538
SMILESCOc1ccccc1-n1nc(C)cc1Oc1ccccc1NC(=O)Nc1ccc(OC(F)(F)F)cc1