Reaction Details
TargetP2Y purinoceptor 1
LigandBDBM50373327
Substrate/Competitorn/a
Meas. Tech.ChEMBL_467631 (CHEMBL930506)
Ki 700±n/a nM
Citation Pfefferkorn, JAChoi, CWinters, TKennedy, RChi, LPerrin, LALu, GPing, YWMcClanahan, TSchroeder, RLeininger, MTGeyer, ASchefzick, SAtherton, J P2Y1 receptor antagonists as novel antithrombotic agents. Bioorg Med Chem Lett18:3338-43 (2008) 
 
P2Y purinoceptor 1
Name:P2Y purinoceptor 1
Type:Enzyme
Mol. Mass.:42090.25
Organism:Homo sapiens (Human)
Description:P47900
Residue:373
BDBM50373327
NameBDBM50373327
Synonyms:CHEMBL402597
TypeSmall organic molecule
Emp. Form.C25H24N4O2
Mol. Mass.412.4837
SMILESCCc1ccccc1-n1nc(C)cc1Oc1ccccc1NC(=O)Nc1ccccc1