Reaction Details
TargetNociceptin receptor
LigandBDBM50239745
Substrate/Competitorn/a
Meas. Tech.ChEMBL_467785 (CHEMBL931349)
IC50 3.3±n/a nM
Citation Okamoto, OKobayashi, KKawamoto, HIto, SSatoh, AKato, TYamamoto, IMizutani, SHashimoto, MShimizu, ASakoh, HNagatomi, YIwasawa, YTakahashi, HIshii, YOzaki, SOhta, H Identification of novel benzimidazole series of potent and selective ORL1 antagonists. Bioorg Med Chem Lett18:3278-81 (2008) 
 
Nociceptin receptor
Name:Nociceptin receptor
Type:G Protein-Coupled Receptor (GPCR)
Mol. Mass.:40702.87
Organism:Homo sapiens (Human)
Description:P41146
Residue:370
BDBM50239745
NameBDBM50239745
Synonyms:2-(4-(6-chloro-2-(pentan-3-ylthio)-3H-benzo[d]imidazol-5-yl)piperazin-1-yl)ethanol | CHEMBL407325
TypeSmall organic molecule
Emp. Form.C18H27ClN4OS
Mol. Mass.382.951
SMILESCCC(CC)Sc1nc2cc(Cl)c(cc2[nH]1)N1CCN(CCO)CC1