Reaction Details
TargetNociceptin receptor
LigandBDBM50373370
Substrate/Competitorn/a
Meas. Tech.ChEMBL_467785 (CHEMBL931349)
IC50 930±n/a nM
Citation Okamoto, OKobayashi, KKawamoto, HIto, SSatoh, AKato, TYamamoto, IMizutani, SHashimoto, MShimizu, ASakoh, HNagatomi, YIwasawa, YTakahashi, HIshii, YOzaki, SOhta, H Identification of novel benzimidazole series of potent and selective ORL1 antagonists. Bioorg Med Chem Lett18:3278-81 (2008) 
 
Nociceptin receptor
Name:Nociceptin receptor
Type:G Protein-Coupled Receptor (GPCR)
Mol. Mass.:40702.87
Organism:Homo sapiens (Human)
Description:P41146
Residue:370
BDBM50373370
NameBDBM50373370
Synonyms:CHEMBL263889
TypeSmall organic molecule
Emp. Form.C18H25FN4S
Mol. Mass.348.481
SMILESFc1cc2nc(SCC3CCCCC3)[nH]c2cc1N1CCNCC1