Reaction Details
TargetNociceptin receptor
LigandBDBM50373366
Substrate/Competitorn/a
Meas. Tech.ChEMBL_467785 (CHEMBL931349)
IC50 78±n/a nM
Citation Okamoto, OKobayashi, KKawamoto, HIto, SSatoh, AKato, TYamamoto, IMizutani, SHashimoto, MShimizu, ASakoh, HNagatomi, YIwasawa, YTakahashi, HIshii, YOzaki, SOhta, H Identification of novel benzimidazole series of potent and selective ORL1 antagonists. Bioorg Med Chem Lett18:3278-81 (2008) 
 
Nociceptin receptor
Name:Nociceptin receptor
Type:G Protein-Coupled Receptor (GPCR)
Mol. Mass.:40702.87
Organism:Homo sapiens (Human)
Description:P41146
Residue:370
BDBM50373366
NameBDBM50373366
Synonyms:CHEMBL258711
TypeSmall organic molecule
Emp. Form.C17H23N5S
Mol. Mass.329.463
SMILESCCC(CC)Sc1nc2cc(C#N)c(cc2[nH]1)N1CCNCC1