Reaction Details
TargetNociceptin receptor
LigandBDBM50373365
Substrate/Competitorn/a
Meas. Tech.ChEMBL_467784 (CHEMBL931348)
IC50 2.1±n/a nM
Citation Okamoto, OKobayashi, KKawamoto, HIto, SSatoh, AKato, TYamamoto, IMizutani, SHashimoto, MShimizu, ASakoh, HNagatomi, YIwasawa, YTakahashi, HIshii, YOzaki, SOhta, H Identification of novel benzimidazole series of potent and selective ORL1 antagonists. Bioorg Med Chem Lett18:3278-81 (2008) 
 
Nociceptin receptor
Name:Nociceptin receptor
Type:G Protein-Coupled Receptor (GPCR)
Mol. Mass.:40702.87
Organism:Homo sapiens (Human)
Description:P41146
Residue:370
BDBM50373365
NameBDBM50373365
Synonyms:CHEMBL258710
TypeSmall organic molecule
Emp. Form.C16H23ClN4S
Mol. Mass.338.899
SMILESCCC(CC)Sc1nc2cc(Cl)c(cc2[nH]1)N1CCNCC1