Reaction Details
TargetNociceptin receptor
LigandBDBM50373383
Substrate/Competitorn/a
Meas. Tech.ChEMBL_467784 (CHEMBL931348)
IC50 8200±n/a nM
Citation Okamoto, OKobayashi, KKawamoto, HIto, SSatoh, AKato, TYamamoto, IMizutani, SHashimoto, MShimizu, ASakoh, HNagatomi, YIwasawa, YTakahashi, HIshii, YOzaki, SOhta, H Identification of novel benzimidazole series of potent and selective ORL1 antagonists. Bioorg Med Chem Lett18:3278-81 (2008) 
 
Nociceptin receptor
Name:Nociceptin receptor
Type:G Protein-Coupled Receptor (GPCR)
Mol. Mass.:40702.87
Organism:Homo sapiens (Human)
Description:P41146
Residue:370
BDBM50373383
NameBDBM50373383
Synonyms:CHEMBL411890
TypeSmall organic molecule
Emp. Form.C25H24F2N4S
Mol. Mass.450.547
SMILESFc1ccc(CSc2nc3cc(F)c(cc3[nH]2)N2CCN(Cc3ccccc3)CC2)cc1