Reaction Details
TargetNociceptin receptor
LigandBDBM50239749
Substrate/Competitorn/a
Meas. Tech.ChEMBL_467785 (CHEMBL931349)
IC50 0.660000±n/a nM
Citation Okamoto, OKobayashi, KKawamoto, HIto, SSatoh, AKato, TYamamoto, IMizutani, SHashimoto, MShimizu, ASakoh, HNagatomi, YIwasawa, YTakahashi, HIshii, YOzaki, SOhta, H Identification of novel benzimidazole series of potent and selective ORL1 antagonists. Bioorg Med Chem Lett18:3278-81 (2008) 
 
Nociceptin receptor
Name:Nociceptin receptor
Type:G Protein-Coupled Receptor (GPCR)
Mol. Mass.:40702.87
Organism:Homo sapiens (Human)
Description:P41146
Residue:370
BDBM50239749
NameBDBM50239749
Synonyms:2-(4-(6-chloro-2-(3-methylpentan-3-ylthio)-3H-benzo[d]imidazol-5-yl)piperazin-1-yl)ethanol CHEMBL263918
TypeSmall organic molecule
Emp. Form.C19H29ClN4OS
Mol. Mass.396.978
SMILESCCC(C)(CC)Sc1nc2cc(Cl)c(cc2[nH]1)N1CCN(CCO)CC1