Reaction Details
TargetNociceptin receptor
LigandBDBM50239754
Substrate/Competitorn/a
Meas. Tech.ChEMBL_467785 (CHEMBL931349)
IC50 21±n/a nM
Citation Okamoto, OKobayashi, KKawamoto, HIto, SSatoh, AKato, TYamamoto, IMizutani, SHashimoto, MShimizu, ASakoh, HNagatomi, YIwasawa, YTakahashi, HIshii, YOzaki, SOhta, H Identification of novel benzimidazole series of potent and selective ORL1 antagonists. Bioorg Med Chem Lett18:3278-81 (2008) 
 
Nociceptin receptor
Name:Nociceptin receptor
Type:G Protein-Coupled Receptor (GPCR)
Mol. Mass.:40702.87
Organism:Homo sapiens (Human)
Description:P41146
Residue:370
BDBM50239754
NameBDBM50239754
Synonyms:2-(4-(2-(tert-butylthio)-6-chloro-3H-benzo[d]imidazol-5-yl)piperazin-1-yl)ethanol | CHEMBL259185
TypeSmall organic molecule
Emp. Form.C17H25ClN4OS
Mol. Mass.368.925
SMILESCC(C)(C)Sc1nc2cc(Cl)c(cc2[nH]1)N1CCN(CCO)CC1