Reaction Details
TargetRAC-alpha serine/threonine-protein kinase
LigandBDBM15169
Substrate/Competitorn/a
Meas. Tech.ChEMBL_467869 (CHEMBL937419)
IC50 200±n/a nM
Citation Bilodeau, MTBalitza, AEHoffman, JMManley, PJBarnett, SFDefeo-Jones, DHaskell, KJones, RELeander, KRobinson, RGSmith, AMHuber, HEHartman, GD Allosteric inhibitors of Akt1 and Akt2: a naphthyridinone with efficacy in an A2780 tumor xenograft model. Bioorg Med Chem Lett18:3178-82 (2008) 
 
RAC-alpha serine/threonine-protein kinase
Name:RAC-alpha serine/threonine-protein kinase
Type:Enzyme
Mol. Mass.:55681.25
Organism:Homo sapiens (Human)
Description:P31749
Residue:480
BDBM15169
NameBDBM15169
Synonyms:1-{1-[(4-{7-phenyl-1H-imidazo[4,5-g]quinoxalin-6-yl}phenyl)methyl]piperidin-4-yl}-2,3-dihydro-1H-1,3-benzodiazol-2-one imidazoquinoxaline | imidazoquinoxaline 16h
TypeSmall organic molecule
Emp. Form.C34H29N7O
Mol. Mass.551.6404
SMILESO=c1[nH]c2ccccc2n1C1CCN(Cc2ccc(cc2)-c2nc3cc4[nH]cnc4cc3nc2-c2ccccc2)CC1