Reaction Details
Target5-hydroxytryptamine receptor 2A
LigandBDBM50102712
Substrate/Competitorn/a
Meas. Tech.ChEMBL_467935 (CHEMBL951044)
Ki 900±n/a nM
Citation Prante, OTietze, RHocke, CLöber, SHübner, HKuwert, TGmeiner, P Synthesis, radiofluorination, and in vitro evaluation of pyrazolo[1,5-a]pyridine-based dopamine D4 receptor ligands: discovery of an inverse agonist radioligand for PET. J Med Chem51:1800-10 (2008) 
 
5-hydroxytryptamine receptor 2A
Name:5-hydroxytryptamine receptor 2A
Type:Enzyme Catalytic Domain
Mol. Mass.:52679.13
Organism:PIG
Description:5-HT2 0 0::P50129
Residue:470
BDBM50102712
NameBDBM50102712
Synonyms:2-((4-(4-chlorophenyl)piperazin-1-yl)methyl)-pyrazolo[1,5-a]pyridine 2-[4-(4-Chloro-phenyl)-piperazin-1-ylmethyl]-pyrazolo[1,5-a]pyridine CHEMBL310843
TypeSmall organic molecule
Emp. Form.C18H19ClN4
Mol. Mass.326.823
SMILESClc1ccc(cc1)N1CCN(Cc2cc3ccccn3n2)CC1