Reaction Details
TargetMelanocortin receptor 4
LigandBDBM50373512
Substrate/Competitorn/a
Meas. Tech.ChEMBL_467951 (CHEMBL947014)
EC50 10.0±n/a nM
Citation Chen, CJiang, WTran, JATucci, FCFleck, BAMarkison, SWen, JMadan, AHoare, SRFoster, ACMarinkovic, DChen, CWArellano, MSaunders, J Identification and characterization of pyrrolidine diastereoisomers as potent functional agonists and antagonists of the human melanocortin-4 receptor. Bioorg Med Chem Lett18:129-36 (2008) 
 
Melanocortin receptor 4
Name:Melanocortin receptor 4
Type:Enzyme
Mol. Mass.:36949.50
Organism:Homo sapiens (Human)
Description:P32245
Residue:332
BDBM50373512
NameBDBM50373512
Synonyms:CHEMBL272538
TypeSmall organic molecule
Emp. Form.C36H52ClN5O3
Mol. Mass.638.283
SMILESCC(C)[C@H](NC(=O)CCN(C)C)c1cc(C)ccc1N1CCN(CC1)C(=O)[C@@H]1CN(C[C@H]1c1ccc(Cl)cc1)C1CCOCC1