Reaction Details
TargetVoltage-dependent T-type calcium channel subunit alpha-1H
LigandBDBM50373617
Substrate/Competitorn/a
Meas. Tech.ChEMBL_468020 (CHEMBL947231)
IC50 110±n/a nM
Citation Hangeland, JJCheney, DLFriends, TJSwartz, SLevesque, PCRich, AJSun, LBridal, TRAdam, LPNormandin, DEMurugesan, NEwing, WR Design and SAR of selective T-type calcium channel antagonists containing a biaryl sulfonamide core. Bioorg Med Chem Lett18:474-8 (2008) 
 
Voltage-dependent T-type calcium channel subunit alpha-1H
Name:Voltage-dependent T-type calcium channel subunit alpha-1H
Type:Enzyme Catalytic Domain
Mol. Mass.:259187.68
Organism:Homo sapiens (Human)
Description:Calcium channel (Type T,L) 0 0::O95180
Residue:2353
BDBM50373617
NameBDBM50373617
Synonyms:CHEMBL403689
TypeSmall organic molecule
Emp. Form.C30H28ClN3O5S
Mol. Mass.578.078
SMILESCN(CC(=O)Nc1cccc(c1)S(=O)(=O)N(Cc1ccccc1)c1cccc(Cl)c1)C(=O)OCc1ccccc1