Reaction Details
TargetNeuropeptide Y receptor type 5
LigandBDBM50373639
Substrate/Competitorn/a
Meas. Tech.ChEMBL_468024 (CHEMBL948247)
Ki 1.1±n/a nM
Citation Li, GStamford, AWHuang, YCheng, KCCook, JFarley, CGao, JGhibaudi, LGreenlee, WJGuzzi, Mvan Heek, MHwa, JJKelly, JMullins, DParker, EMWainhaus, SZhang, X Discovery of novel orally active ureido NPY Y5 receptor antagonists. Bioorg Med Chem Lett18:1146-50 (2008) 
 
Neuropeptide Y receptor type 5
Name:Neuropeptide Y receptor type 5
Type:Enzyme
Mol. Mass.:50746.64
Organism:Homo sapiens (Human)
Description:Q15761
Residue:445
BDBM50373639
NameBDBM50373639
Synonyms:CHEMBL428423
TypeSmall organic molecule
Emp. Form.C19H28Cl2N4O3S
Mol. Mass.463.422
SMILESCN(C1CCN(CC1)S(C)(=O)=O)C(=O)NC1CCN(CC1)c1cc(Cl)cc(Cl)c1