Reaction Details
TargetNeuropeptide Y receptor type 5
LigandBDBM50373643
Substrate/Competitorn/a
Meas. Tech.ChEMBL_468024 (CHEMBL948247)
Ki 13±n/a nM
Citation Li, GStamford, AWHuang, YCheng, KCCook, JFarley, CGao, JGhibaudi, LGreenlee, WJGuzzi, Mvan Heek, MHwa, JJKelly, JMullins, DParker, EMWainhaus, SZhang, X Discovery of novel orally active ureido NPY Y5 receptor antagonists. Bioorg Med Chem Lett18:1146-50 (2008) 
 
Neuropeptide Y receptor type 5
Name:Neuropeptide Y receptor type 5
Type:Enzyme
Mol. Mass.:50746.64
Organism:Homo sapiens (Human)
Description:Q15761
Residue:445
BDBM50373643
NameBDBM50373643
Synonyms:CHEMBL255352
TypeSmall organic molecule
Emp. Form.C19H29ClN4O3S
Mol. Mass.428.977
SMILESCN(C1CCN(CC1)S(C)(=O)=O)C(=O)NC1CCN(CC1)c1cccc(Cl)c1