Reaction Details
TargetNeuropeptide Y receptor type 5
LigandBDBM50373650
Substrate/Competitorn/a
Meas. Tech.ChEMBL_468024 (CHEMBL948247)
Ki 5.9±n/a nM
Citation Li, GStamford, AWHuang, YCheng, KCCook, JFarley, CGao, JGhibaudi, LGreenlee, WJGuzzi, Mvan Heek, MHwa, JJKelly, JMullins, DParker, EMWainhaus, SZhang, X Discovery of novel orally active ureido NPY Y5 receptor antagonists. Bioorg Med Chem Lett18:1146-50 (2008) 
 
Neuropeptide Y receptor type 5
Name:Neuropeptide Y receptor type 5
Type:Enzyme
Mol. Mass.:50746.64
Organism:Homo sapiens (Human)
Description:Q15761
Residue:445
BDBM50373650
NameBDBM50373650
Synonyms:CHEMBL257248
TypeSmall organic molecule
Emp. Form.C22H32F2N4O2
Mol. Mass.422.5119
SMILESCCCC(=O)N1CCC(CC1)N(C)C(=O)NC1CCN(CC1)c1cc(F)cc(F)c1