Reaction Details
TargetAngiotensin-converting enzyme
LigandBDBM50373659
Substrate/Competitorn/a
Meas. Tech.ChEMBL_468056 (CHEMBL930672)
IC50 23±n/a nM
Citation Hanessian, SGuesné, SRiber, LMarin, JBenoist, AMennecier, PRupin, AVerbeuren, TJDe Nanteuil, G Targeting ACE and ECE with dual acting inhibitors. Bioorg Med Chem Lett18:1058-62 (2008) 
 
Angiotensin-converting enzyme
Name:Angiotensin-converting enzyme
Type:Enzyme
Mol. Mass.:149709.01
Organism:Homo sapiens (Human)
Description:n/a
Residue:1306
BDBM50373659
NameBDBM50373659
Synonyms:CHEMBL258278
TypeSmall organic molecule
Emp. Form.C17H24N2O8
Mol. Mass.384.3811
SMILESCC(C)CN(C[C@H](O)C(O)=O)C(=O)N[C@@H](Cc1ccc(O)c(O)c1)C(O)=O