Reaction Details
TargetNeprilysin
LigandBDBM50373662
Substrate/Competitorn/a
Meas. Tech.ChEMBL_468058 (CHEMBL930674)
IC50 19000±n/a nM
Citation Hanessian, SGuesné, SRiber, LMarin, JBenoist, AMennecier, PRupin, AVerbeuren, TJDe Nanteuil, G Targeting ACE and ECE with dual acting inhibitors. Bioorg Med Chem Lett18:1058-62 (2008) 
 
Neprilysin
Name:Neprilysin
Type:Enzyme
Mol. Mass.:85505.38
Organism:Homo sapiens (Human)
Description:P08473
Residue:750
BDBM50373662
NameBDBM50373662
Synonyms:CHEMBL256895
TypeSmall organic molecule
Emp. Form.C31H28N2O6
Mol. Mass.524.5638
SMILESO[C@@H](CN(Cc1ccc-2c(Cc3ccccc-23)c1)C(=O)N[C@@H](Cc1ccc2ccccc2c1)C(O)=O)C(O)=O