Reaction Details
TargetNeprilysin
LigandBDBM50373663
Substrate/Competitorn/a
Meas. Tech.ChEMBL_468058 (CHEMBL930674)
IC50 5±n/a nM
Citation Hanessian, SGuesné, SRiber, LMarin, JBenoist, AMennecier, PRupin, AVerbeuren, TJDe Nanteuil, G Targeting ACE and ECE with dual acting inhibitors. Bioorg Med Chem Lett18:1058-62 (2008) 
 
Neprilysin
Name:Neprilysin
Type:Enzyme
Mol. Mass.:85505.38
Organism:Homo sapiens (Human)
Description:P08473
Residue:750
BDBM50373663
NameBDBM50373663
Synonyms:CHEMBL273142
TypeSmall organic molecule
Emp. Form.C22H28N2O6
Mol. Mass.416.4675
SMILESCC(C)(C)CN(C[C@H](O)C(O)=O)C(=O)N[C@@H](Cc1ccc2ccccc2c1)C(O)=O