Reaction Details
TargetNeprilysin
LigandBDBM50373664
Substrate/Competitorn/a
Meas. Tech.ChEMBL_468058 (CHEMBL930674)
IC50 9±n/a nM
Citation Hanessian, SGuesné, SRiber, LMarin, JBenoist, AMennecier, PRupin, AVerbeuren, TJDe Nanteuil, G Targeting ACE and ECE with dual acting inhibitors. Bioorg Med Chem Lett18:1058-62 (2008) 
 
Neprilysin
Name:Neprilysin
Type:Enzyme
Mol. Mass.:85505.38
Organism:Homo sapiens (Human)
Description:P08473
Residue:750
BDBM50373664
NameBDBM50373664
Synonyms:CHEMBL409920
TypeSmall organic molecule
Emp. Form.C21H26N2O6
Mol. Mass.402.4409
SMILESCC(C)CN(C[C@H](O)C(O)=O)C(=O)N[C@@H](Cc1cccc2ccccc12)C(O)=O