Reaction Details
TargetAngiotensin-converting enzyme
LigandBDBM50373666
Substrate/Competitorn/a
Meas. Tech.ChEMBL_468056 (CHEMBL930672)
IC50 1980±n/a nM
Citation Hanessian, SGuesné, SRiber, LMarin, JBenoist, AMennecier, PRupin, AVerbeuren, TJDe Nanteuil, G Targeting ACE and ECE with dual acting inhibitors. Bioorg Med Chem Lett18:1058-62 (2008) 
 
Angiotensin-converting enzyme
Name:Angiotensin-converting enzyme
Type:Enzyme
Mol. Mass.:149709.01
Organism:Homo sapiens (Human)
Description:n/a
Residue:1306
BDBM50373666
NameBDBM50373666
Synonyms:CHEMBL271718
TypeSmall organic molecule
Emp. Form.C31H27N3O8
Mol. Mass.569.5614
SMILESO[C@@H](CN(CCN1C(=O)c2cccc3cccc(C1=O)c23)C(=O)N[C@@H](Cc1ccc2ccccc2c1)C(O)=O)C(O)=O