Reaction Details
TargetAngiotensin-converting enzyme
LigandBDBM50373662
Substrate/Competitorn/a
Meas. Tech.ChEMBL_468056 (CHEMBL930672)
IC50 150±n/a nM
Citation Hanessian, SGuesné, SRiber, LMarin, JBenoist, AMennecier, PRupin, AVerbeuren, TJDe Nanteuil, G Targeting ACE and ECE with dual acting inhibitors. Bioorg Med Chem Lett18:1058-62 (2008) 
 
Angiotensin-converting enzyme
Name:Angiotensin-converting enzyme
Type:Enzyme
Mol. Mass.:149709.01
Organism:Homo sapiens (Human)
Description:n/a
Residue:1306
BDBM50373662
NameBDBM50373662
Synonyms:CHEMBL256895
TypeSmall organic molecule
Emp. Form.C31H28N2O6
Mol. Mass.524.5638
SMILESO[C@@H](CN(Cc1ccc-2c(Cc3ccccc-23)c1)C(=O)N[C@@H](Cc1ccc2ccccc2c1)C(O)=O)C(O)=O