Reaction Details
TargetAngiotensin-converting enzyme
LigandBDBM50373668
Substrate/Competitorn/a
Meas. Tech.ChEMBL_468056 (CHEMBL930672)
IC50 60±n/a nM
Citation Hanessian, SGuesné, SRiber, LMarin, JBenoist, AMennecier, PRupin, AVerbeuren, TJDe Nanteuil, G Targeting ACE and ECE with dual acting inhibitors. Bioorg Med Chem Lett18:1058-62 (2008) 
 
Angiotensin-converting enzyme
Name:Angiotensin-converting enzyme
Type:Enzyme
Mol. Mass.:149709.01
Organism:Homo sapiens (Human)
Description:n/a
Residue:1306
BDBM50373668
NameBDBM50373668
Synonyms:CHEMBL270576
TypeSmall organic molecule
Emp. Form.C17H24N2O7
Mol. Mass.368.3817
SMILESCC(C)CN(C[C@H](O)C(O)=O)C(=O)N[C@@H](Cc1ccc(O)cc1)C(O)=O