Reaction Details
TargetNeprilysin
LigandBDBM50373665
Substrate/Competitorn/a
Meas. Tech.ChEMBL_468058 (CHEMBL930674)
IC50 2±n/a nM
Citation Hanessian, SGuesné, SRiber, LMarin, JBenoist, AMennecier, PRupin, AVerbeuren, TJDe Nanteuil, G Targeting ACE and ECE with dual acting inhibitors. Bioorg Med Chem Lett18:1058-62 (2008) 
 
Neprilysin
Name:Neprilysin
Type:Enzyme
Mol. Mass.:85505.38
Organism:Homo sapiens (Human)
Description:P08473
Residue:750
BDBM50373665
NameBDBM50373665
Synonyms:CHEMBL442455
TypeSmall organic molecule
Emp. Form.C19H25N2O6P
Mol. Mass.408.3854
SMILESCC(C)CN(CP(O)(O)=O)C(=O)N[C@@H](Cc1ccc2ccccc2c1)C(O)=O