Reaction Details
TargetNeprilysin
LigandBDBM50373659
Substrate/Competitorn/a
Meas. Tech.ChEMBL_468058 (CHEMBL930674)
IC50 19±n/a nM
Citation Hanessian, SGuesné, SRiber, LMarin, JBenoist, AMennecier, PRupin, AVerbeuren, TJDe Nanteuil, G Targeting ACE and ECE with dual acting inhibitors. Bioorg Med Chem Lett18:1058-62 (2008) 
 
Neprilysin
Name:Neprilysin
Type:Enzyme
Mol. Mass.:85505.38
Organism:Homo sapiens (Human)
Description:P08473
Residue:750
BDBM50373659
NameBDBM50373659
Synonyms:CHEMBL258278
TypeSmall organic molecule
Emp. Form.C17H24N2O8
Mol. Mass.384.3811
SMILESCC(C)CN(C[C@H](O)C(O)=O)C(=O)N[C@@H](Cc1ccc(O)c(O)c1)C(O)=O