Reaction Details
TargetLysophosphatidic acid receptor 2
LigandBDBM50373814
Substrate/Competitorn/a
Meas. Tech.ChEMBL_468543 (CHEMBL930968)
IC50 1300±n/a nM
Citation Beck, HPKohn, TRubenstein, SHedberg, CSchwandner, RHasslinger, KDai, KLi, CLiang, LWesche, HFrank, BAn, SWickramasinghe, DJaen, JMedina, JHungate, RShen, W Discovery of potent LPA2 (EDG4) antagonists as potential anticancer agents. Bioorg Med Chem Lett18:1037-41 (2008) 
 
Lysophosphatidic acid receptor 2
Name:Lysophosphatidic acid receptor 2
Type:PROTEIN
Mol. Mass.:39103.44
Organism:Homo sapiens (Human)
Description:ChEMBL_1451385
Residue:351
BDBM50373814
NameBDBM50373814
Synonyms:CHEMBL270877
TypeSmall organic molecule
Emp. Form.C23H26F3N5O
Mol. Mass.445.4806
SMILESCOc1ccccc1N1CCN(C[C@H](C)Nc2nc(nc3ccccc23)C(F)(F)F)CC1