Reaction Details
TargetLysophosphatidic acid receptor 2
LigandBDBM50373816
Substrate/Competitorn/a
Meas. Tech.ChEMBL_468543 (CHEMBL930968)
IC50 6610±n/a nM
Citation Beck, HPKohn, TRubenstein, SHedberg, CSchwandner, RHasslinger, KDai, KLi, CLiang, LWesche, HFrank, BAn, SWickramasinghe, DJaen, JMedina, JHungate, RShen, W Discovery of potent LPA2 (EDG4) antagonists as potential anticancer agents. Bioorg Med Chem Lett18:1037-41 (2008) 
 
Lysophosphatidic acid receptor 2
Name:Lysophosphatidic acid receptor 2
Type:PROTEIN
Mol. Mass.:39103.44
Organism:Homo sapiens (Human)
Description:ChEMBL_1451385
Residue:351
BDBM50373816
NameBDBM50373816
Synonyms:CHEMBL270237
TypeSmall organic molecule
Emp. Form.C18H29N5O2S2
Mol. Mass.411.585
SMILESCCCCS(=O)(=O)N1CCN(C[C@H](C)Nc2ncnc3c(C)csc23)CC1