Reaction Details
TargetLysophosphatidic acid receptor 2
LigandBDBM50373817
Substrate/Competitorn/a
Meas. Tech.ChEMBL_468543 (CHEMBL930968)
IC50 260±n/a nM
Citation Beck, HPKohn, TRubenstein, SHedberg, CSchwandner, RHasslinger, KDai, KLi, CLiang, LWesche, HFrank, BAn, SWickramasinghe, DJaen, JMedina, JHungate, RShen, W Discovery of potent LPA2 (EDG4) antagonists as potential anticancer agents. Bioorg Med Chem Lett18:1037-41 (2008) 
 
Lysophosphatidic acid receptor 2
Name:Lysophosphatidic acid receptor 2
Type:PROTEIN
Mol. Mass.:39103.44
Organism:Homo sapiens (Human)
Description:ChEMBL_1451385
Residue:351
BDBM50373817
NameBDBM50373817
Synonyms:CHEMBL404452
TypeSmall organic molecule
Emp. Form.C21H27N5S
Mol. Mass.381.538
SMILESC[C@@H](CN1CCN(CC1)c1ccccc1C)Nc1ncnc2c(C)csc12