Reaction Details
TargetLysophosphatidic acid receptor 2
LigandBDBM50373827
Substrate/Competitorn/a
Meas. Tech.ChEMBL_468543 (CHEMBL930968)
IC50 35±n/a nM
Citation Beck, HPKohn, TRubenstein, SHedberg, CSchwandner, RHasslinger, KDai, KLi, CLiang, LWesche, HFrank, BAn, SWickramasinghe, DJaen, JMedina, JHungate, RShen, W Discovery of potent LPA2 (EDG4) antagonists as potential anticancer agents. Bioorg Med Chem Lett18:1037-41 (2008) 
 
Lysophosphatidic acid receptor 2
Name:Lysophosphatidic acid receptor 2
Type:PROTEIN
Mol. Mass.:39103.44
Organism:Homo sapiens (Human)
Description:ChEMBL_1451385
Residue:351
BDBM50373827
NameBDBM50373827
Synonyms:CHEMBL270865
TypeSmall organic molecule
Emp. Form.C20H24ClN5O2S2
Mol. Mass.466.02
SMILESC[C@@H](CN1CCN(CC1)S(=O)(=O)c1cccc(Cl)c1)Nc1ncnc2c(C)csc12