Reaction Details
TargetLysophosphatidic acid receptor 2
LigandBDBM50373818
Substrate/Competitorn/a
Meas. Tech.ChEMBL_468543 (CHEMBL930968)
IC50>50000±n/a nM
Citation Beck, HPKohn, TRubenstein, SHedberg, CSchwandner, RHasslinger, KDai, KLi, CLiang, LWesche, HFrank, BAn, SWickramasinghe, DJaen, JMedina, JHungate, RShen, W Discovery of potent LPA2 (EDG4) antagonists as potential anticancer agents. Bioorg Med Chem Lett18:1037-41 (2008) 
 
Lysophosphatidic acid receptor 2
Name:Lysophosphatidic acid receptor 2
Type:PROTEIN
Mol. Mass.:39103.44
Organism:Homo sapiens (Human)
Description:ChEMBL_1451385
Residue:351
BDBM50373818
NameBDBM50373818
Synonyms:CHEMBL404575
TypeSmall organic molecule
Emp. Form.C19H18N2O3
Mol. Mass.322.3578
SMILESCC(OC(=O)Nc1c(C)noc1-c1ccccc1)c1ccccc1