Reaction Details
TargetLysophosphatidic acid receptor 1
LigandBDBM50373826
Substrate/Competitorn/a
Meas. Tech.ChEMBL_468544 (CHEMBL930969)
IC50>50000±n/a nM
Citation Beck, HPKohn, TRubenstein, SHedberg, CSchwandner, RHasslinger, KDai, KLi, CLiang, LWesche, HFrank, BAn, SWickramasinghe, DJaen, JMedina, JHungate, RShen, W Discovery of potent LPA2 (EDG4) antagonists as potential anticancer agents. Bioorg Med Chem Lett18:1037-41 (2008) 
 
Lysophosphatidic acid receptor 1
Name:Lysophosphatidic acid receptor 1
Type:Enzyme
Mol. Mass.:41120.55
Organism:Homo sapiens (Human)
Description:Q92633
Residue:364
BDBM50373826
NameBDBM50373826
Synonyms:CHEMBL256470
TypeSmall organic molecule
Emp. Form.C20H23Cl2N5O2S2
Mol. Mass.500.465
SMILESC[C@@H](CN1CCN(CC1)S(=O)(=O)c1ccc(Cl)c(Cl)c1)Nc1ncnc2c(C)csc12