Reaction Details
TargetLysophosphatidic acid receptor 3
LigandBDBM50373831
Substrate/Competitorn/a
Meas. Tech.ChEMBL_468545 (CHEMBL931968)
IC50 40±n/a nM
Citation Beck, HPKohn, TRubenstein, SHedberg, CSchwandner, RHasslinger, KDai, KLi, CLiang, LWesche, HFrank, BAn, SWickramasinghe, DJaen, JMedina, JHungate, RShen, W Discovery of potent LPA2 (EDG4) antagonists as potential anticancer agents. Bioorg Med Chem Lett18:1037-41 (2008) 
 
Lysophosphatidic acid receptor 3
Name:Lysophosphatidic acid receptor 3
Type:Enzyme
Mol. Mass.:40149.72
Organism:Homo sapiens (Human)
Description:Q9UBY5
Residue:353
BDBM50373831
NameBDBM50373831
Synonyms:CHEMBL272087
TypeSmall organic molecule
Emp. Form.C32H31NO6
Mol. Mass.525.5916
SMILESCOc1cc(OC)cc(c1)C(=O)N(CCCc1ccccc1)Cc1ccc(Oc2ccccc2C(O)=O)cc1