Reaction Details
Target5-hydroxytryptamine receptor 1A
LigandBDBM50329675
Substrate/Competitorn/a
Meas. Tech.ChEMBL_468662 (CHEMBL950989)
Ki 0.2±n/a nM
Citation Lacivita, ELeopoldo, M N-[omega-[4-(2-methoxyphenyl)-1-piperazinyl]alkyl]-2-quinolinamines as high-affinity fluorescent 5-HT1A receptor ligands. J Med Chem51:1492-5 (2008) 
 
5-hydroxytryptamine receptor 1A
Name:5-hydroxytryptamine receptor 1A
Type:n/a
Mol. Mass.:46122.49
Organism:Homo sapiens (Human)
Description:n/a
Residue:422
BDBM50329675
NameBDBM50329675
Synonyms:6-methoxy-N-(4-(4-(2-methoxyphenyl)piperazin-1-yl)butyl)quinolin-2-amine N-[2-[4-(2-methoxyphenyl)-1-piperazinyl]butyl]-6-methoxy-2-quinolinamine
TypeSmall organic molecule
Emp. Form.C25H32N4O2
Mol. Mass.420.5472
SMILESCOc1ccc2nc(NCCCCN3CCN(CC3)c3ccccc3OC)ccc2c1