Reaction Details
TargetProstaglandin E2 receptor EP4 subtype
LigandBDBM50373941
Substrate/Competitorn/a
Meas. Tech.ChEMBL_468779 (CHEMBL933109)
Ki 1±n/a nM
Citation Xiao, YAraldi, GLZhao, ZReddy, AKarra, SBrugger, NFischer, DPalmer, EBao, BMcKenna, SD Synthesis and evaluation of a gamma-lactam as a highly selective EP2 and EP4 receptor agonist. Bioorg Med Chem Lett18:821-4 (2008) 
 
Prostaglandin E2 receptor EP4 subtype
Name:Prostaglandin E2 receptor EP4 subtype
Type:Enzyme
Mol. Mass.:53134.53
Organism:Homo sapiens (Human)
Description:P35408
Residue:488
BDBM50373941
NameBDBM50373941
Synonyms:CHEMBL257217
TypeSmall organic molecule
Emp. Form.C22H31NO4
Mol. Mass.373.4858
SMILESCCCCCC[C@H](O)\C=C\[C@H]1CCC(=O)N1CCc1ccc(cc1)C(O)=O