Reaction Details
TargetMitogen-activated protein kinase 14
LigandBDBM50164236
Substrate/Competitorn/a
Meas. Tech.ChEMBL_468802 (CHEMBL932042)
IC50 4.4±n/a nM
Citation Mader, Mde Dios, AShih, CBonjouklian, RLi, TWhite, WLópez de Uralde, BSánchez-Martinez, Cdel Prado, MJaramillo, Cde Diego, EMartín Cabrejas, LMDominguez, CMontero, CShepherd, TDally, RToth, JEChatterjee, APleite, SBlanco-Urgoiti, JPerez, LBarberis, MLorite, MJJambrina, ENevill, CRLee, PASchultz, RCWolos, JALi, LCCampbell, RMAnderson, BD Imidazolyl benzimidazoles and imidazo[4,5-b]pyridines as potent p38alpha MAP kinase inhibitors with excellent in vivo antiinflammatory properties. Bioorg Med Chem Lett18:179-83 (2008) 
 
Mitogen-activated protein kinase 14
Name:Mitogen-activated protein kinase 14
Type:Serine/threonine-protein kinase
Mol. Mass.:41286.76
Organism:Homo sapiens (Human)
Description:Q16539
Residue:360
BDBM50164236
NameBDBM50164236
Synonyms:6-[2-tert-Butyl-5-(2,4-difluoro-phenyl)-3H-imidazol-4-yl]-1-(propane-2-sulfonyl)-1H-benzoimidazol-2-ylamine; compound with methanesulfonic acid CHEMBL404377
TypeSmall organic molecule
Emp. Form.C23H25F2N5O2S
Mol. Mass.473.539
SMILESCC(C)S(=O)(=O)n1c(N)nc2ccc(cc12)-c1[nH]c(nc1-c1ccc(F)cc1F)C(C)(C)C