Reaction Details
TargetMuscarinic acetylcholine receptor M3
LigandBDBM50374006
Substrate/Competitorn/a
Meas. Tech.ChEMBL_468831 (CHEMBL932204)
Ki 24±n/a nM
Citation Jones, LHRandall, ANapier, CTrevethick, MSreckovic, SWatson, J Design and synthesis of a fluorescent muscarinic antagonist. Bioorg Med Chem Lett18:825-7 (2008) 
 
Muscarinic acetylcholine receptor M3
Name:Muscarinic acetylcholine receptor M3
Type:Enzyme
Mol. Mass.:66151.03
Organism:Homo sapiens (Human)
Description:P20309
Residue:590
BDBM50374006
NameBDBM50374006
Synonyms:CHEMBL257643
TypeSmall organic molecule
Emp. Form.C26H41N3
Mol. Mass.395.6227
SMILESCCN(CC)c1ccc(\C=C\c2cc[n+](CCC[N+](CC)(CC)CC)cc2)cc1