Reaction Details
TargetMuscarinic acetylcholine receptor M5
LigandBDBM50374005
Substrate/Competitorn/a
Meas. Tech.ChEMBL_468833 (CHEMBL932206)
Ki 83±n/a nM
Citation Jones, LHRandall, ANapier, CTrevethick, MSreckovic, SWatson, J Design and synthesis of a fluorescent muscarinic antagonist. Bioorg Med Chem Lett18:825-7 (2008) 
 
Muscarinic acetylcholine receptor M5
Name:Muscarinic acetylcholine receptor M5
Type:PROTEIN
Mol. Mass.:60102.35
Organism:Homo sapiens (Human)
Description:ChEMBL_1517990
Residue:532
BDBM50374005
NameBDBM50374005
Synonyms:CHEMBL257431
TypeSmall organic molecule
Emp. Form.C30H49N3
Mol. Mass.451.7291
SMILESCCCCN(CCCC)c1ccc(\C=C\c2cc[n+](CCC[N+](CC)(CC)CC)cc2)cc1