Reaction Details
TargetHistone deacetylase 1
LigandBDBM50229199
Substrate/Competitorn/a
Meas. Tech.ChEMBL_468834 (CHEMBL947921)
IC50 130±n/a nM
Citation Methot, JLChakravarty, PKChenard, MClose, JCruz, JCDahlberg, WKFleming, JHamblett, CLHamill, JEHarrington, PHarsch, AHeidebrecht, RHughes, BJung, JKenific, CMKral, AMMeinke, PTMiddleton, REOzerova, NSloman, DLStanton, MGSzewczak, AATyagarajan, SWitter, DJSecrist, JPMiller, TA Exploration of the internal cavity of histone deacetylase (HDAC) with selective HDAC1/HDAC2 inhibitors (SHI-1:2). Bioorg Med Chem Lett18:973-8 (2008) 
 
Histone deacetylase 1
Name:Histone deacetylase 1
Type:Enzyme
Mol. Mass.:55090.27
Organism:Homo sapiens (Human)
Description:Q13547
Residue:482
BDBM50229199
NameBDBM50229199
Synonyms:CHEMBL398884 | thiophene-2-carboxylic acid (4-hydroxy-biphenyl-3-yl)-amide
TypeSmall organic molecule
Emp. Form.C17H13NO2S
Mol. Mass.295.356
SMILESOc1ccc(cc1NC(=O)c1cccs1)-c1ccccc1