Reaction Details
TargetHistone deacetylase 1
LigandBDBM50374048
Substrate/Competitorn/a
Meas. Tech.ChEMBL_468834 (CHEMBL947921)
IC50 5300±n/a nM
Citation Methot, JLChakravarty, PKChenard, MClose, JCruz, JCDahlberg, WKFleming, JHamblett, CLHamill, JEHarrington, PHarsch, AHeidebrecht, RHughes, BJung, JKenific, CMKral, AMMeinke, PTMiddleton, REOzerova, NSloman, DLStanton, MGSzewczak, AATyagarajan, SWitter, DJSecrist, JPMiller, TA Exploration of the internal cavity of histone deacetylase (HDAC) with selective HDAC1/HDAC2 inhibitors (SHI-1:2). Bioorg Med Chem Lett18:973-8 (2008) 
 
Histone deacetylase 1
Name:Histone deacetylase 1
Type:Enzyme
Mol. Mass.:55090.27
Organism:Homo sapiens (Human)
Description:Q13547
Residue:482
BDBM50374048
NameBDBM50374048
Synonyms:CHEMBL403448
TypeSmall organic molecule
Emp. Form.C20H20N4O
Mol. Mass.332.399
SMILESCN(C)c1ccc(cc1)-c1ccc(N)c(NC(=O)c2cccnc2)c1