Reaction Details
TargetHistone deacetylase 1
LigandBDBM50374051
Substrate/Competitorn/a
Meas. Tech.ChEMBL_468834 (CHEMBL947921)
IC50>50000±n/a nM
Citation Methot, JLChakravarty, PKChenard, MClose, JCruz, JCDahlberg, WKFleming, JHamblett, CLHamill, JEHarrington, PHarsch, AHeidebrecht, RHughes, BJung, JKenific, CMKral, AMMeinke, PTMiddleton, REOzerova, NSloman, DLStanton, MGSzewczak, AATyagarajan, SWitter, DJSecrist, JPMiller, TA Exploration of the internal cavity of histone deacetylase (HDAC) with selective HDAC1/HDAC2 inhibitors (SHI-1:2). Bioorg Med Chem Lett18:973-8 (2008) 
 
Histone deacetylase 1
Name:Histone deacetylase 1
Type:Enzyme
Mol. Mass.:55090.27
Organism:Homo sapiens (Human)
Description:Q13547
Residue:482
BDBM50374051
NameBDBM50374051
Synonyms:CHEMBL428600
TypeSmall organic molecule
Emp. Form.C28H27N5O
Mol. Mass.449.5469
SMILESNc1ccc(cc1NC(=O)c1cccnc1)-c1ccc(cc1)N1CCN(CC1)c1ccccc1