Reaction Details
TargetHistone deacetylase 3
LigandBDBM50374007
Substrate/Competitorn/a
Meas. Tech.ChEMBL_468836 (CHEMBL947923)
IC50 11000±n/a nM
Citation Methot, JLChakravarty, PKChenard, MClose, JCruz, JCDahlberg, WKFleming, JHamblett, CLHamill, JEHarrington, PHarsch, AHeidebrecht, RHughes, BJung, JKenific, CMKral, AMMeinke, PTMiddleton, REOzerova, NSloman, DLStanton, MGSzewczak, AATyagarajan, SWitter, DJSecrist, JPMiller, TA Exploration of the internal cavity of histone deacetylase (HDAC) with selective HDAC1/HDAC2 inhibitors (SHI-1:2). Bioorg Med Chem Lett18:973-8 (2008) 
 
Histone deacetylase 3
Name:Histone deacetylase 3
Type:Enzyme
Mol. Mass.:48829.55
Organism:Homo sapiens (Human)
Description:O15379
Residue:428
BDBM50374007
NameBDBM50374007
Synonyms:CHEMBL271949
TypeSmall organic molecule
Emp. Form.C17H14N2OS
Mol. Mass.294.371
SMILESNc1ccc(cc1NC(=O)c1ccccc1)-c1cccs1