Reaction Details
TargetHistone deacetylase 5
LigandBDBM50374011
Substrate/Competitorn/a
Meas. Tech.ChEMBL_468838 (CHEMBL947925)
IC50>50000±n/a nM
Citation Methot, JLChakravarty, PKChenard, MClose, JCruz, JCDahlberg, WKFleming, JHamblett, CLHamill, JEHarrington, PHarsch, AHeidebrecht, RHughes, BJung, JKenific, CMKral, AMMeinke, PTMiddleton, REOzerova, NSloman, DLStanton, MGSzewczak, AATyagarajan, SWitter, DJSecrist, JPMiller, TA Exploration of the internal cavity of histone deacetylase (HDAC) with selective HDAC1/HDAC2 inhibitors (SHI-1:2). Bioorg Med Chem Lett18:973-8 (2008) 
 
Histone deacetylase 5
Name:Histone deacetylase 5
Type:Enzyme
Mol. Mass.:121968.61
Organism:Homo sapiens (Human)
Description:Q9UQL6
Residue:1122
BDBM50374011
NameBDBM50374011
Synonyms:CHEMBL437029
TypeSmall organic molecule
Emp. Form.C31H31N5O3
Mol. Mass.521.6095
SMILESC[C@H]1CN(CCN1C(=O)OCc1ccccc1)c1ccc(cn1)C(=O)Nc1cc(ccc1N)-c1ccccc1