Reaction Details
TargetHistone deacetylase 4
LigandBDBM50232053
Substrate/Competitorn/a
Meas. Tech.ChEMBL_468837 (CHEMBL947924)
IC50>50000±n/a nM
Citation Methot, JLChakravarty, PKChenard, MClose, JCruz, JCDahlberg, WKFleming, JHamblett, CLHamill, JEHarrington, PHarsch, AHeidebrecht, RHughes, BJung, JKenific, CMKral, AMMeinke, PTMiddleton, REOzerova, NSloman, DLStanton, MGSzewczak, AATyagarajan, SWitter, DJSecrist, JPMiller, TA Exploration of the internal cavity of histone deacetylase (HDAC) with selective HDAC1/HDAC2 inhibitors (SHI-1:2). Bioorg Med Chem Lett18:973-8 (2008) 
 
Histone deacetylase 4
Name:Histone deacetylase 4
Type:Enzyme
Mol. Mass.:119049.39
Organism:Homo sapiens (Human)
Description:P56524
Residue:1084
BDBM50232053
NameBDBM50232053
Synonyms:CHEMBL271741 N-(4-aminobiphenyl-3-yl)benzamide
TypeSmall organic molecule
Emp. Form.C19H16N2O
Mol. Mass.288.3431
SMILESNc1ccc(cc1NC(=O)c1ccccc1)-c1ccccc1