Reaction Details
TargetCyclin-dependent kinase 1
LigandBDBM50374071
Substrate/Competitorn/a
Meas. Tech.ChEMBL_468883 (CHEMBL949046)
IC50 200±n/a nM
Citation Smaill, JBLee, HHPalmer, BDThompson, AMSquire, CJBaker, ENBooth, RJKraker, AHook, KDenny, WA Synthesis and structure-activity relationships of soluble 8-substituted 4-(2-chlorophenyl)-9-hydroxypyrrolo[3,4-c]carbazole-1,3(2H,6H)-diones as inhibitors of the Wee1 and Chk1 checkpoint kinases. Bioorg Med Chem Lett18:929-33 (2008) 
 
Cyclin-dependent kinase 1
Name:Cyclin-dependent kinase 1
Type:Enzyme Subunit
Mol. Mass.:34101.08
Organism:Homo sapiens (Human)
Description:P06493
Residue:297
BDBM50374071
NameBDBM50374071
Synonyms:CHEMBL272946
TypeSmall organic molecule
Emp. Form.C28H26ClN3O3
Mol. Mass.487.977
SMILESOc1cc2c(cc1CCCCN1CCCC1)[nH]c1cc(c3C(=O)NC(=O)c3c21)-c1ccccc1Cl